BDBM471591 US10822334, Compound 3
SMILES COc1ccc2ncnc(Nc3ccc(Oc4ccn5ncnc5c4)c(C)c3)c2c1OC1CCN(C)CC1F
InChI Key InChIKey=IVBJRBFTTSFLEL-UHFFFAOYSA-N
Data  2 IC50
  Tab Delimited (TSV)   2D SDfile   Computed 3D by Vconf -m prep SDfile
Find this compound or compounds like it in BindingDB:
Activity Spreadsheet -- Enzyme Inhibition Constant Data from BindingDB
Found 1 hit for monomerid = 471591
TargetEpidermal growth factor receptor(Homo sapiens (Human))
TBA
US Patent
LigandPNGBDBM471591(US10822334, Compound 3)
Affinity DataIC50: >3.00E+3nM. Assay description: EGFR: The compounds' inhibition of target modulation were determined as follows: NCI-H838 cells were sorted in 96 well plates (20000 cells/well) ...
Ligand InfoPC cidPC sid
In DepthDetails US Patent